DE/DWD/CDC
type: Concept
definition: The Climate Data Center (CDC) of the German Weather Service (Deutscher Wetterdienst - DWD) offers assess to climate data for Germany, but also to data with a European or even global context. The aim is to simplify the users' access to data, in particular for users from research, educational and public institutions, but also from other sectors, so that they obtain the needed data as quickly as possible.
change note: 2019-07-19 12:25:28.0 [mmorahan] Cut Concepts delete narrower relation (null);
change note: 2019-07-19 12:22:03.0 [mmorahan] Move Concepts add narrower relation (DE/DWD/NKDZ [28b761b9-18ad-4c0d-a27c-34a66f9f08c6,337343] - UNI-KIEL/IFM [0523f90f-d56d-4bba-bd7a-cb9672130e9d,340831]);
change note: 2019-07-19 12:41:38.0 [mmorahan] Rename Concept update PrefLabel (DE/DWD/CDC);
change note: 2019-07-19 14:42:34.0 [mmorahan] update AltLabel (Climate Data Center, Deutscher Wetterdienst (German Meteorological Service), Germany); update Definition (The Climate Data Center (CDC) of the German Weather Service (Deutscher Wetterdienst - DWD) offers assess to climate data for Germany, but also to data with a European or even global context. The aim is to simplify the users' access to data, in particular for users from research, educational and public institutions, but also from other sectors, so that they obtain the needed data as quickly as possible.); update Resource (provider); update Resource (http://www.dwd.de/cdc;28b761b9-18ad-4c0d-a27c-34a66f9f08c6);
in scheme: providers

GERMANY
type: Concept