VATECH/CMI
type: Concept
in scheme: providers
definition: The Conservation Management Institute (CMI) is a research center within the College of Natural Resources at Virginia Tech. CMI was established in 2000 to better address multi-disciplinary research questions that affect conservation management effectiveness in Virginia, North America, and the world. Faculty from Virginia Tech and other research institutions work collaboratively on projects ranging from endangered species propagation to natural resource-based satellite imagery interpretation. Summary provided by http://www.cmiweb.org/about.html

ACADEMIC
type: Concept