COLD SEEP
type: Concept
change note: 2016-06-14 11:47:08.0 [gee-cee] insert Definition (id: null text: Pertaining to areas of hydrogen sulfide, methane, and other hydrocarbon releases from the ocean floor. language code: en);
change note: 2016-06-14 11:46:12.0 [gee-cee] Insert Concept add broader relation (COLD SEEP [290354cc-c670-4845-bb66-ef1974b1e2a2,188245] - ABYSSAL [1c286cb7-2668-4db3-a5ac-cb8b710bebc2,188241]);
in scheme: sciencekeywords
definition: Pertaining to areas of hydrogen sulfide, methane, and other hydrocarbon releases from the ocean floor.

ABYSSAL
type: Concept