U-CHICAGO/CSDC
type: Concept
change note: 2019-07-09 13:07:29.0 [tstevens] insert AltLabel (id: null category: primary text: Center for Spatial Data Science, University of Chicago language code: en); update PrefLabel (U-CHICAGO/CSDC); insert Definition (id: null text: At the Center for Spatial Data Science (CSDS), we think spatially about research problems: We develop state-of-the-art methods for geospatial analysis; implement them through open source software tools; apply them to policy-relevant research in the social sciences; and disseminate them through education and support to a growing worldwide community of over 270,000 spatial analysts. Locally, we are building a spatial community at the University of Chicago. CSDS is an initiative of the Division of Social Sciences and part of the UChicago's investment in computational social science. As of July 2016, CSDS succeeded the GeoDa Center for Geospatial Analysis and Computation at Arizona State University. language code: en); insert Resource (id: null type: provider url: https://spatial.uchicago.edu/);
change note: 2019-07-09 13:05:53.0 [tstevens] Insert Concept add broader relation (U-Chicago/CSDC [2987c5f4-367a-441d-b93c-0905e565132b,368925] - ACADEMIC [7700280b-68ee-4644-bf5e-84e7a6adf897,337181]);
in scheme: providers
definition: At the Center for Spatial Data Science (CSDS), we think spatially about research problems: We develop state-of-the-art methods for geospatial analysis; implement them through open source software tools; apply them to policy-relevant research in the social sciences; and disseminate them through education and support to a growing worldwide community of over 270,000 spatial analysts. Locally, we are building a spatial community at the University of Chicago. CSDS is an initiative of the Division of Social Sciences and part of the UChicago's investment in computational social science. As of July 2016, CSDS succeeded the GeoDa Center for Geospatial Analysis and Computation at Arizona State University.

ACADEMIC
type: Concept