CRYOSPHERIC INDICATORS
type: Concept

SNOW ENERGY BALANCE
type: Concept
change note: 2012-07-10 15:55:30.0 [mpmorahan] insert Definition (id: null text: Pertaining to the net increase, or decrease in energy due to snow formation, melting, evaporation, etc.. language code: en);
change note: 2012-06-26 13:42:09.0 [gee-cee] Insert Concept add broader relation (SNOW ENERGY BALANCE [29f386e9-84fb-4e5d-9733-20233c63b1be,39943] - CRYOSPHERIC INDICATORS [76b8c21c-c221-4724-86ef-c07222cb152b,39899]);
in scheme: sciencekeywords
definition: Pertaining to the net increase, or decrease in energy due to snow formation, melting, evaporation, etc..