FIRE DYNAMICS
type: Concept
in scheme: sciencekeywords
definition: Describes the physical state of the fire and/or its effect. This may include the time and location, duration, aerial extent, temperature, radiative power, and emission products of the fire event.

FIRE ECOLOGY
type: Concept