SACC
type: Concept
in scheme: projects
definition: The South American Climate Change (SACC) Consortium is an initiative sponsored by the IAI through the Cooperative Research Networks (CRN) Program. The general purpose of the SACC Consortium is: To coordinate and enhance human and institutional resources in South American countries, in order to advance the understanding of the coupled effects of global change and climate variability on the oceanic, atmospheric and terrestrial ecosystems of the Western South Atlantic region. Summary provided by http://www.sacc.org.uy/index.php?start_from=5&ucat=&archive=&subaction=&id=&

S - U
type: Concept