CANADA
type: Concept

CA/MB/MC/GEO
type: Concept
in scheme: providers
definition: The Manitoba Remote Sensing Centre was established in 1974 and has skilled staff with varied backgrounds in geography, forestry, biology, cartography, and business. The staff are able to combine their varied experiences in applying remote sensing technology to many resource and environmental issues. Summary Provided by: http://www.gov.mb.ca/conservation/geomatics/remote_sensing/index.html