ISCGM
type: Concept
in scheme: providers
definition: The primary purpose of this Committee is to examine measures that concerned national, regional and international organizations can take to foster the development of Global Mapping in order to facilitate the implementation of global agreements and conventions for environmental protection as well as the mitigation of natural disasters and to encourage economic growth within the context of sustainable development. Summary provided by: http://www.iscgm.org/cgi-bin/fswiki/wiki.cgi?page=establishment

CONSORTIA/INSTITUTIONS
type: Concept