SALINITY/DENSITY
type: Concept

PYCNOCLINE
type: Concept
in scheme: sciencekeywords
definition: The zone of the ocean in which density increases rapidly with depth. Temperature falls and salinity rises in this zone.