Subsurface
type: Concept

Sonsub Innovator
type: Concept
change note: 2022-02-22 14:11:30.0 [tstevens] update Definition ();
change note: 2021-11-18 09:40:22.0 [tstevens] Move Concepts delete broader relation (null); add broader relation (Sonsub Innovator [2adc78b1-be95-4cec-82a9-603f6a493d5b,826088] - Subsurface [31eb34c8-016e-48c4-9404-7d94ee66cfde,835901]);
change note: 2020-01-21 13:08:31.0 [tstevens] insert Definition (id: null text: The Innovator is Sonsub’s new in-house manufactured, high-specification, high reliability, 3500 meter depth-rated, 150 HP ROV, capable of performing demanding deep-water construction and drill support tasks. The Innovator has many ground-breaking features which serve to minimize the amount of optical and electrical subsea equipment necessary for operations, while improving performance, flexibility, and reliability of the key components. The versatility of the Innovator allows it to perform a variety of functions as well as act as a platform for the operation of a suite of task specific, Sonsub built tools and equipment. language code: en);
change note: 2020-01-21 12:25:56.0 [tstevens] Insert Concept add broader relation (Sonsub Innovator [2adc78b1-be95-4cec-82a9-603f6a493d5b,559735] - ROV [da6420b6-48ec-4ae2-98c7-0ef0538815a0,542741]);
in scheme: platforms
definition: The Innovator is Sonsub’s new in-house manufactured, high-specification, high reliability, 3500 meter depth-rated, 150 HP ROV, capable of performing demanding deep-water construction and drill support tasks. The Innovator has many ground-breaking features which serve to minimize the amount of optical and electrical subsea equipment necessary for operations, while improving performance, flexibility, and reliability of the key components. The versatility of the Innovator allows it to perform a variety of functions as well as act as a platform for the operation of a suite of task specific, Sonsub built tools and equipment.