BLOCKING INDEX
type: Concept
in scheme: sciencekeywords
definition: Blocking in the southern hemisphere typically occurs at lower latitudes when compared with the northern hemisphere. The index follows Tibaldi et al. (1994). The European blocking index is based on observations of pentad (5-day average) wind over the region 15W to 25E and 35n to 55N. If the pentad zonal wind equals the climatological value for that time period, the index is zero. If the pentad zonal wind is less than average the index is postive, while the opposite is true if the index is negative. Values close to +/- 1 indicate relatively strong events.

TELECONNECTIONS
type: Concept