HYDRATION
type: Concept
change note: 2013-03-22 09:06:12.0 [tbs1979] update Definition (Glossary of Geology); update Definition (Pertaining to the process by which water molecules are incorporated into existing crystal structures.);
change note: 2013-02-18 07:55:57.0 [tbs1979] Move Concepts delete broader relation (null); add broader relation (HYDRATION [2b1f870b-c679-4b6d-b02e-3eb005f0648d,64071] - GEOCHEMICAL PROCESSES [e6fb1b81-8ffc-486f-b1a1-2f292af8cee6,82335]);
in scheme: sciencekeywords
definition: Pertaining to the process by which water molecules are incorporated into existing crystal structures.

GEOCHEMICAL PROCESSES
type: Concept