CONSORTIA/INSTITUTIONS
type: Concept

HSWRI
type: Concept
in scheme: providers
definition: Hubbs-SeaWorld Research Institute is dedicated to ensuring that future generations experience the benefits of a healthy environment by conserving the ecological integrity of our oceans and estuaries as a foundation for marine-based economies, sustainable fisheries, public recreation, transportation, tourism, and quality of life. Summary Provided By: http://www.hswri.org/