Temperature/Humidity Sensors
type: Concept

Vaisala HMT330
type: Concept
change note: 2023-03-10 16:32:07.0 [sritz] insert Definition (id: null text: Vaisala HMT330 Series HUMICAPâ Humidity and Temperature Transmitters are designed for demanding industrial applications where stable measurements and extensive customization are essential. With multiple options to choose from, the instrument can be tailored to meet the specific needs of each individual application and is pre-configured for each delivery language code: en);
change note: 2023-03-10 16:33:31.0 [sritz] update Definition (Vaisala HMT330 Series HUMICAPâ Humidity and Temperature Transmitters are designed for demanding industrial applications where stable measurements and extensive customization are essential. With multiple options to choose from, the instrument can be tailored to meet the specific needs of each individual application and is pre-configured for each delivery.);
change note: 2023-03-10 16:29:56.0 [sritz] Insert Concept add broader relation (Vaisala HMT330 [2baac496-5b58-46a5-9201-d7dbd691eb5e,1246972] - Temperature/Humidity Sensors [bb5a51d9-0ded-40ed-9bfd-7cb0e788f1a5,1239017]);
change note: 2023-03-10 16:30:26.0 [sritz] insert AltLabel (id: null category: primary text: Vaisala HMT330 Temperature and Humidity Sensor language code: en);
definition: Vaisala HMT330 Series HUMICAPâ Humidity and Temperature Transmitters are designed for demanding industrial applications where stable measurements and extensive customization are essential. With multiple options to choose from, the instrument can be tailored to meet the specific needs of each individual application and is pre-configured for each delivery.
in scheme: instruments