COMMERCIAL
type: Concept

PDI
type: Concept
in scheme: providers
definition: New York, June 8, 2000 —Plumb Design, the New York-based interactive services and software firm, announces its involvement in the redesign of www.emplive.com, the Web site for Experience Music Project (EMP), the experiential rock 'n' roll museum opening in Seattle on June 23, 2000. EMP is a new kind of museum that celebrates the innovation and creativity of American popular music as embodied by rock 'n' roll, its ancestors (R&B, jazz, soul, gospel, etc.) and descendents (punk, hip hop, electronica, etc.). Visitors to the museum see an extensive collection of artifacts, ranging from fragments of the guitar smashed by Jimi Hendrix at the 1967 Monterey Pop Festival to Dr. Dre's drum machine. Summary Provided By: http://www.thinkmap.com/pressrelease.jsp?id=74