LAKE LEVELS
type: Concept
change note: 2012-07-24 15:55:15.0 [mpmorahan] insert Definition (id: null text: Lake level fluctuations can provide important evidence for paleoclimatic conditions, particulary in arid and semiarid areas. Lake levels are particularly sensitive to changes in hydrologic balance due to climatic fluctuations. Lakes may develop and expand if there is an abundance of precipitation and will recede and even dry up (due to evaporation) during prolonged droughts. Lake sediment cores are often drilled to provide stratigraphic clues to past climate conditions. language code: en);
change note: 2012-06-26 15:09:43.0 [gee-cee] Insert Concept add broader relation (LAKE LEVELS [2c99427c-1a6a-4326-b072-0c12c87bd944,40047] - OCEAN/LAKE RECORDS [5237fae3-c98e-4d4a-9013-d7c824b3862b,40027]);
in scheme: sciencekeywords
definition: Lake level fluctuations can provide important evidence for paleoclimatic conditions, particulary in arid and semiarid areas. Lake levels are particularly sensitive to changes in hydrologic balance due to climatic fluctuations. Lakes may develop and expand if there is an abundance of precipitation and will recede and even dry up (due to evaporation) during prolonged droughts. Lake sediment cores are often drilled to provide stratigraphic clues to past climate conditions.

OCEAN/LAKE RECORDS
type: Concept