CLOUD PROPERTIES
type: Concept

CLOUD MIDLAYER TEMPERATURE
type: Concept
change note: 2013-02-14 13:36:07.0 [mpmorahan] Move Concepts delete broader relation (null); add broader relation (CLOUD MIDLAYER TEMPERATURE [2ca13dfa-c2b3-47de-8175-f0723151ef28,62599] - CLOUD PROPERTIES [c9e429cb-eff0-4dd3-9eca-527e0081f65c,82133]);
in scheme: sciencekeywords
definition: Atmospheric temperature observed at the middle of a cloud layer.