COMPOSITION/TEXTURE
type: Concept
change note: 2013-03-13 14:13:56.0 [tbs1979] insert Definition (id: null text: An analysis of the composition and texture of igneous rocks within the solid Earth. language code: en);
change note: 2013-03-05 10:30:22.0 [tbs1979] Insert Concept add broader relation (COMPOSITION/TEXTURE [2cb4e7de-fba7-420a-9137-ac10e298fd63,82947] - IGNEOUS ROCK PHYSICAL/OPTICAL PROPERTIES [a17a781d-01b0-470c-a4e2-e91ca8b1fbdc,82943]);
in scheme: sciencekeywords
definition: An analysis of the composition and texture of igneous rocks within the solid Earth.

IGNEOUS ROCK PHYSICAL/OPTICAL PROPERTIES
type: Concept