FREEZE/FROST
type: Concept

FIRST FREEZE/FROST DATE
type: Concept
in scheme: sciencekeywords
definition: First frost is first occurrence of 36°F temperature, first freeze was based on the first occurrence of 32°F temperature.
change note: 2016-06-28 13:42:53.0 [saritz] Insert Concept add broader relation (FREEZE/FROST DATE [2cc64007-a443-45d8-bf9d-c9fae69f4554,217703] - FREEZE/FROST [5be5caa4-9f86-47ff-a08f-fb1eb97918b5,217701]);
change note: 2016-06-28 13:43:41.0 [saritz] insert Definition (id: null text: First frost is first occurrence of 36°F temperature, first freeze was based on the first occurrence of 32°F temperature. language code: en);
change note: 2016-07-15 11:18:57.0 [saritz] Move Concepts delete broader relation (null); add broader relation (FIRST FREEZE/FROST DATE [2cc64007-a443-45d8-bf9d-c9fae69f4554,217703] - FREEZE/FROST1 [4539272a-f041-4fc6-883d-4c4c5bef1683,85025]);
change note: 2016-06-28 13:44:12.0 [saritz] update PrefLabel (FIRST FREEZE/FROST DATE);