TEMPERATURE PROBES
type: Concept
change note: 2021-08-05 17:42:30.0 [sritz] insert AltLabel (id: null category: primary text: TEMPERATURE PROBES language code: en);
in scheme: instruments
definition: A Temperature Probe is a device used to directly measure the temperature in a substance, be it soil, water or air. Temperature probes are used on aircraft to measure outside air temperature; often in conjunction with other sensors as in Bowen ratio apparatus; or used to determine water temperature. [Source: NASA] Group: Instrument_Details Entry_ID: TEMPERATURE PROBES Group: Instrument_Identification Instrument_Category: In Situ/Laboratory Instruments Instrument_Class: Probes Short_Name: TEMPERATURE PROBES End_Group Group: Associated_Platforms Short_Name: DC-8 Short_Name: AIRCRAFT End_Group End_Group

Probes
type: Concept