BORA WINDS
type: Concept
change note: 2017-04-21 12:32:28.0 [tstevens] insert Definition (id: null text: A fall wind with a source so cold that, when the air reaches the lowlands or coast, the dynamic warming is insufficient to raise the air temperature to the normal level for the region; hence it appears as a cold wind. language code: en);
change note: 2017-04-20 15:17:21.0 [sritz] Insert Concept add broader relation (BORA WINDS [2cf573dd-0ed7-4455-a233-5987b5a8b52a,278913] - OROGRAPHIC WINDS [a1df1d50-dd2b-4944-bda5-0cf1127e2f49,278903]);
in scheme: sciencekeywords
definition: A fall wind with a source so cold that, when the air reaches the lowlands or coast, the dynamic warming is insufficient to raise the air temperature to the normal level for the region; hence it appears as a cold wind.

OROGRAPHIC WINDS
type: Concept