Models
type: Concept

RASI
type: Concept
change note: 2021-11-30 13:23:54.0 [tstevens] Move Concepts delete broader relation (null); add broader relation (RASI [2d0c75bf-49bc-4a76-bd77-b179ea677bc2,826095] - Models [0a184cdc-c074-4946-90a6-02f03c686341,835911]);
change note: 2014-11-07 10:41:04.0 [epneff] added RASI keyword at request of GHRC insert AltLabel (id: null text: Regional Air-Sea Interaction language code: en);
change note: 2014-11-07 10:40:23.0 [epneff] Insert Concept add broader relation (RASI [2d0c75bf-49bc-4a76-bd77-b179ea677bc2,106665] - Models/Analyses [113ecbc2-ab36-4d58-a96c-a6ce0106e749,73395]);
alternative label: Regional Air-Sea Interaction
in scheme: platforms
definition: Regional Air-Sea Interaction analyses Group: Platform_Details Entry_ID: RASI Group: Platform_Identification Platform_Category: MODELS/ANALYSES Short_Name: RASI Long_Name: REGIONAL AIR-SEA INTERACTION End_Group Creation_Date: 2014-11-07 End_Group