MULTINATIONAL ORGANIZATIONS
type: Concept

UN/FAO/WAICENT
type: Concept
in scheme: providers
definition: The WAICENT Information Finder is part of FAO's commitment to improve access to timely and relevant technical information on agriculture and food security. Website: "http://www.fao.org/waicent/index_en.asp"