Dartmouth/Earth-Sci
type: Concept
change note: 2022-07-25 13:26:26.0 [tstevens] insert AltLabel (id: null category: primary text: Department of Earth Sciences, Dartmouth College language code: en); insert Definition (id: null text: Faculty, research scientists, postdoctoral scholars, and graduate students in the Department of Earth Sciences, as well as affiliated faculty from other departments, conduct research that commonly transcends the boundaries of classic sub-disciplines in Earth Science. language code: en);
change note: 2022-07-25 13:24:22.0 [tstevens] Insert Concept add broader relation (Dartmouth/Earth-Sci [2d8c00f3-fa7d-44b8-b486-92bd204e648c,996679] - ACADEMIC [7700280b-68ee-4644-bf5e-84e7a6adf897,982803]);
in scheme: providers
definition: Faculty, research scientists, postdoctoral scholars, and graduate students in the Department of Earth Sciences, as well as affiliated faculty from other departments, conduct research that commonly transcends the boundaries of classic sub-disciplines in Earth Science.

ACADEMIC
type: Concept