LAND PRODUCTIVITY
type: Concept
change note: 2013-08-16 09:14:14.0 [tbs1979] update Definition (Webster's Revised Unabridged Dictionary. ); update Definition (The rate of production, especially of food, by the utilization of solar energy by producer organisms.);
in scheme: sciencekeywords
definition: The rate of production, especially of food, by the utilization of solar energy by producer organisms.

LAND USE/LAND COVER
type: Concept