IN/NCL/NCBI
type: Concept
in scheme: providers
definition: NCL Centre for Biodiversity Informatics (NCBI) is an effort to collect, collates, analyze, predict and disseminate knowledge about Indian biota and it’s environ. National Chemical Laboratory, Pune in 2000 took this initiative as part of its scientific informatics activities in the field of biodiversity informatics. Summary provided by: http://www.ncbi.org.in/

INDIA
type: Concept