GERMANY
type: Concept

DE/EUMETSAT
type: Concept
change note: 2014-05-19 09:39:46.0 [128.183.164.42] insert AltLabel (id: null text: European Organisation for the Exploitation of Meteorological Satellites language code: en);
change note: 2014-05-19 09:34:14.0 [128.183.164.42] Insert Concept add broader relation (DE/EUMETSAT [2edd14d2-501d-4ec3-9989-16e2f6a0dde6,106391] - GERMANY [c1d6f18d-1a8c-4ed1-a85d-c2b0912fbf5f,66619]);
in scheme: providers
definition: EUMETSAT is a global operational satellite agency at the heart of Europe. Our purpose is to gather accurate and reliable satellite data on weather, climate and the environment around the clock, and to deliver them to our Member and Cooperating States, to our international partners, and to users world-wide.