RWI
type: Concept
in scheme: providers
definition: All-in-one tool that allows you to visualize, interpret and present your surface and sub-surface data. Summary Provided By: http://www.rockware.com/index.php

COMMERCIAL
type: Concept