Models
type: Concept

CHIRPS
type: Concept
change note: 2021-05-07 17:58:53.0 [sritz] insert AltLabel (id: null category: primary text: Climate Hazards Group Infrared Precipitation with Stations language code: en); insert Definition (id: null text: Climate Hazards Group Infrared Precipitation with Stations language code: en);
change note: 2021-11-30 13:37:37.0 [tstevens] Move Concepts delete broader relation (null); add broader relation (CHIRPS [2f340c79-ed96-4c46-8546-90c14dca2078,826100] - Models [0a184cdc-c074-4946-90a6-02f03c686341,835911]);
change note: 2021-05-07 17:56:10.0 [sritz] Insert Concept add broader relation (CHIRPS [2f340c79-ed96-4c46-8546-90c14dca2078,606906] - Models/Analyses [113ecbc2-ab36-4d58-a96c-a6ce0106e749,597264]);
in scheme: platforms
definition: Climate Hazards Group Infrared Precipitation with Stations