GULLY
type: Concept
change note: 2013-04-01 08:43:47.0 [tbs1979] insert Definition (id: null text: A landform created by running water eroding sharply into soil, typically on a hillside. language code: en);
change note: 2013-02-18 10:37:26.0 [tbs1979] Insert Concept add broader relation (GULLY [2f8ad9b0-adb8-4022-8c95-bca68e7a87a5,82443] - FLUVIAL LANDFORMS [cb5193ab-2d7a-4b35-b7ec-f16ce78ae270,64131]);
in scheme: sciencekeywords
definition: A landform created by running water eroding sharply into soil, typically on a hillside.

FLUVIAL LANDFORMS
type: Concept