Recorders/Loggers
type: Concept

AWS
type: Concept
in scheme: instruments
definition: An Automated Weather System (AWS) provides automatic real-time wind, precipitation, temperature, dew point and pressure information to meteorological observers for preparing routine (every half hourly) and special weather observations reports.