UWI-MAD/SSEC/SOSE
type: Concept
in scheme: providers
definition: The purpose of the Satellite Observations in Science Education site is to improve the teaching and learning of the Earth system through quality educational resources that make use of satellite observations. Recognizing the increasing importance of online learning techniques, this site makes freely available a library of Reusable Content Objects (RCOs) - a toolkit adaptable to a wide variety of applications. Using this toolkit, an educator can quickly assemble highly interactive web-based activities. [Summary provided by the University of Wisconsin, Madison.]

ACADEMIC
type: Concept