LUMINESCENCE
type: Concept
change note: 2013-03-21 14:59:06.0 [tbs1979] insert Definition (id: null text: The emission of “cold light” from minerals. There are several varieties of luminescence, each named according to the source of energy, or the trigger for the luminescence. language code: en);
change note: 2013-03-05 13:16:58.0 [tbs1979] Insert Concept add broader relation (LUMINESCENCE [307f8625-b4cf-4856-9d62-b200e94429a2,83049] - MINERAL PHYSICAL/OPTICAL PROPERTIES [da269095-7270-4a0d-8b43-2c85bd42dd90,83031]);
in scheme: sciencekeywords
definition: The emission of “cold light” from minerals. There are several varieties of luminescence, each named according to the source of energy, or the trigger for the luminescence.

MINERAL PHYSICAL/OPTICAL PROPERTIES
type: Concept