SUBTROPICAL STORM MOTION
type: Concept
change note: 2016-07-31 21:24:36.0 [saritz] update Definition (Change in Subtropical Storm position with respect to time.);
change note: 2016-07-31 21:12:22.0 [saritz] insert Definition (id: null text: Change in Subtropical Cyclone position with respect to time. language code: en);
change note: 2016-07-31 17:10:34.0 [saritz] Insert Concept add broader relation (SUBTROPICAL STORM MOTION [308beca2-b3c8-4cbb-aa9c-e1be605ca785,247473] - SUBTROPICAL STORM [ca133c4d-9751-4b92-a1ec-013ef625ad7b,217773]);
in scheme: sciencekeywords
definition: Change in Subtropical Storm position with respect to time.

SUBTROPICAL STORM
type: Concept