ANISOTROPY
type: Concept
in scheme: sciencekeywords
definition: Anisotropy is the characteristic of a surface for which a physical property, such as reflectivity, varies in value with the direction in or along which the measurement is made.

ATMOSPHERIC RADIATION
type: Concept