CWP
type: Concept
in scheme: projects
definition: Coastal Wave is a leading provider of Internet services and network consulting in Northwest Ohio. Based in Port Clinton, Coastal Wave provides a variety of Internet solutions, including a broadband wireless network spanning a radius of over 50 miles. http://www.coastalwave.net/

A - C
type: Concept