CONTAMINANTS
type: Concept

CARCINOGENS
type: Concept
change note: 2018-03-06 13:06:04.0 [tstevens] Move Concepts delete broader relation (null); add broader relation (CARCINOGENS [31c913e1-9692-45b5-bce5-cca46fa1874d,86463] - CONTAMINANTS [42c6d91b-afef-4638-95c5-0d130828b2e7,84623]);
in scheme: sciencekeywords
definition: The measure of water quality based on the presence of carcinogens.