MARINE SEDIMENTS
type: Concept

TERRIGENOUS SEDIMENTS
type: Concept
in scheme: sciencekeywords
definition: Sediments composed of material derived from land sources and transported to the ocean by wind or flowing water.