Surface
type: Concept

Sea Ice Mass Balance Station
type: Concept
change note: 2022-02-20 14:57:13.0 [tstevens] insert Definition (id: null text: The station consists of a 2m long ice temperature probe, a data logger, a radio telemetry system and a battery power supply. The temperature sensors are spaced at 10 cm intervals inside a stainless steel pole. The pole can be positioned so that some of the upper sensors are in the air, although in the current installation the top sensor is located just below the ice surface. The lower sensors will initially be in the water. The lower sensors gradually freeze into the thickening sea ice cover until the entire pole is frozen in the ice. This typically occurs sometime in late August. Once this occurs the station can no longer report on the thickness of the sea ice, however, it can still give important information on the temperature gradient within the sea ice. language code: en);
change note: 2021-11-18 09:13:00.0 [tstevens] Move Concepts delete broader relation (null); add broader relation (Sea Ice Mass Balance Station [31e96f2f-9b8e-454f-a1f8-e8d791c13a33,826112] - Surface [d93ffd52-5072-4736-b16a-cc4e5113e8b2,835898]);
change note: 2018-10-12 14:51:51.0 [sritz] Insert Concept add broader relation (Sea Ice Mass Balance Station [31e96f2f-9b8e-454f-a1f8-e8d791c13a33,368171] - OCEAN PLATFORM/OCEAN STATIONS [6ee1cf85-aa14-4fe9-a915-a8022830d8a7,345157]);
in scheme: platforms
definition: The station consists of a 2m long ice temperature probe, a data logger, a radio telemetry system and a battery power supply. The temperature sensors are spaced at 10 cm intervals inside a stainless steel pole. The pole can be positioned so that some of the upper sensors are in the air, although in the current installation the top sensor is located just below the ice surface. The lower sensors will initially be in the water. The lower sensors gradually freeze into the thickening sea ice cover until the entire pole is frozen in the ice. This typically occurs sometime in late August. Once this occurs the station can no longer report on the thickness of the sea ice, however, it can still give important information on the temperature gradient within the sea ice.