ACADEMIC
type: Concept

KU-LEUNVEN/DLM/LFNLR
type: Concept
in scheme: providers
definition: The laboratory for forest at Katholieke University develops new methods to extract spatial information over forests and other ecosystems that may contribute to a better understanding and a sustainable management of these systems. These methods are generally based on recent technologies of quantitative analysis, integrating earth observation, geographical information systems, and ecosystem models. Website: "http://www.sadl.kuleuven.ac.be/lbh/lbnl/index_lfnl.htm" [Summary provided by Katholieke University.]