Aerodyne CAPS
type: Concept
change note: 2020-04-14 08:36:47.0 [tstevens] insert AltLabel (id: null category: primary text: Aerodyne Cavity Attenuated Phase-Shift Spectrometers language code: en); insert Definition (id: null text: The CAPS PMex monitor provides a measurement of the optical extinction (the sum of scattering and absorption) of an ambient sample of particles. Currently, there is a choice of 5 different wavelengths – blue (450 nm), green (530 nm), red (630 nm), far red (660 nm ) and near infrared (780 nm, at additional cost) – which match the spectral bands of most other particle optical properties measurement equipment. These instruments have a 1 second time response and provide a level of detection (3σ) less than 2 Mm-1 with 1 second integration time. These monitors are entirely self-contained, requiring no consumables such as zero air and can be operated autonomously for over 12 months using on-board data storage if one second averaging is chosen. language code: en);
change note: 2020-04-14 08:35:43.0 [tstevens] Insert Concept add broader relation (Aerodyne CAPS [3235f243-ac44-4dbd-a94a-e413e98927ac,559909] - Spectrometers [055a79c7-61db-4250-abad-f1e09909f14c,543071]);
in scheme: instruments
definition: The CAPS PMex monitor provides a measurement of the optical extinction (the sum of scattering and absorption) of an ambient sample of particles. Currently, there is a choice of 5 different wavelengths – blue (450 nm), green (530 nm), red (630 nm), far red (660 nm ) and near infrared (780 nm, at additional cost) – which match the spectral bands of most other particle optical properties measurement equipment. These instruments have a 1 second time response and provide a level of detection (3σ) less than 2 Mm-1 with 1 second integration time. These monitors are entirely self-contained, requiring no consumables such as zero air and can be operated autonomously for over 12 months using on-board data storage if one second averaging is chosen.

Spectrometers
type: Concept