NOPP
type: Concept
in scheme: providers
definition: The National Oceanographic Partnership Program (NOPP) is a collaboration of fifteen federal agencies to provide leadership and coordination of national oceanographic research and education initiatives. Summary Provided by: http://www.nopp.org/

CONSORTIA/INSTITUTIONS
type: Concept