WET BULB THERMOMETERS
type: Concept
change note: 2021-08-05 18:01:21.0 [sritz] insert AltLabel (id: null category: primary text: WET BULB THERMOMETERS language code: en);
in scheme: instruments
definition: WET BULB THERMOMETERS, in a psychrometer, the thermometer that has the wet, muslin covered bulb, and, therefore measures the wet-bulb temperature.

Thermometers
type: Concept