Surface
type: Concept

R/V XUELONG
type: Concept
change note: 2022-02-24 09:42:00.0 [tstevens] insert Definition (id: null text: A Chinese icebreaking research vessel. Built in 1993 at Kherson Shipyard in Ukraine, she was converted from an Arctic cargo ship to a polar research and re-supply vessel by Hudong-Zhonghua Shipbuilding of Shanghai by the mid-90s. The vessel was extensively upgraded in 2007 and 2013. language code: en);
change note: 2021-11-18 09:21:06.0 [tstevens] Move Concepts delete broader relation (null); add broader relation (R/V XUELONG [3361bc7c-c1fa-485a-a18a-e67adc5637be,826117] - Surface [59b97a6c-385e-40a2-8422-ecbdb6023c4c,835900]);
in scheme: platforms
definition: A Chinese icebreaking research vessel. Built in 1993 at Kherson Shipyard in Ukraine, she was converted from an Arctic cargo ship to a polar research and re-supply vessel by Hudong-Zhonghua Shipbuilding of Shanghai by the mid-90s. The vessel was extensively upgraded in 2007 and 2013.