ESA/UDS
type: Concept
in scheme: providers
definition: The ESA archive for Ulysses Data provides an on-line facility to browse and download selected measurements made by the scientific instruments flown onboard Ulysses to study the heliosphere in three dimensions. Summary provided by http://helio.esa.int/ulysses/archive/

MULTINATIONAL ORGANIZATIONS
type: Concept