DENDROMETERS
type: Concept
change note: 2021-08-04 18:10:51.0 [sritz] insert AltLabel (id: null category: primary text: DENDROMETERS language code: en);
in scheme: instruments
definition: DENDROMETERS are instruments used for measuring trees (size, height, age).

Recorders/Loggers
type: Concept