TESA
type: Concept
in scheme: projects
definition: Objectives: to cover the lack with geologic cartography of the zone by means of the geologic and geophysical data acquisition of average and hi-res, as much by earth as by sea, that allows to propose integral an evolutionary model of the area; to study the dynamic evolution, the Tectonics and sedimentation in Cenozoic for the limit of plates the South American woman-Scotia, in Atlantic SW and Land the Great Island of the Fire. Information provided by http://ingeodav.fcen.uba.ar/Ingeodav/Laboratorio/Memorias/Plandetareas/Proydeinvestig.htm

S - U
type: Concept