DOI/USGS/WRD/NVWSC
type: Concept
change note: 2014-03-27 14:53:18.0 [epneff] updated url update AltLabel (Nevada Water Science Center, Water Resources Division U.S. Geological Survey, U.S. Department of the Interior); update PrefLabel (DOI/USGS/WRD/NVWSC); insert Definition (id: null text: The Nevada Water Science Center (NVWSC) is committed to providing reliable scientific information about Nevada's natural resources to customers, cooperators, and the public. To provide this scientific information, we operate a widespread surface- and groundwater data collection network as well as research a wide range of scientific issues throughout Nevada. language code: en);
in scheme: providers
definition: The Nevada Water Science Center (NVWSC) is committed to providing reliable scientific information about Nevada's natural resources to customers, cooperators, and the public. To provide this scientific information, we operate a widespread surface- and groundwater data collection network as well as research a wide range of scientific issues throughout Nevada.

USGS
type: Concept