U-NCL/EDDI
type: Concept
in scheme: providers
definition: The European Diatom Database (EDDI) is a web-based information system designed to enhance the application of diatom analysis to problems of surface water acidification, eutrophication and climate change. Summary provided by: http://craticula.ncl.ac.uk/Eddi/jsp/

ACADEMIC
type: Concept